{"text_format":"1","workbook":"xlsx","n_sheets":5,"sheets":["V-Belt Reference Search","LIST","Z-C","SPZ-SPC","XPZ-XPC"],"not_rendered":{"charts":0,"images":2,"macros":1,"external_links":0,"defined_names":36,"comments":0,"pivot_tables":0},"unopened":[],"bounds":{"document_bytes":16777216,"sheet_cells":100000,"rows_first":2000,"rows_last":500,"rows_between":2000,"halvings":0,"cell_chars":16384,"cell_head_chars":4096},"cells_cut":0,"cells_raw":0,"read":"whole","date_system":"1900"}

{"sheet":"V-Belt Reference Search","index":0,"n_rows":31,"n_cols":16,"rows_kept":31,"cut":false,"hidden":false,"merged":[[9,10,9,11],[29,9,29,14],[22,10,22,13],[16,10,16,13],[9,2,9,3],[29,1,29,7],[9,5,9,6],[28,1,28,7],[28,9,28,14]]}
[]
[]
[]
[]
[]
[]
[]
[]
[]
[null,null,"Measured Belt",null,null,"Matching Belt",null,null,null,null,"WRAPPED - CLASSIC"]
[null,null,"Section","Z",null,"Belt",{"$f":"IFERROR(VLOOKUP(G12,INDIRECT(Profile5),2,FALSE),\"---\")","v":"---"},null,null,null,"Section","Z"]
[null,null,"External Lenght [mm]",null,null,"Pitch Lenght [mm]",{"$f":"IF(MIN(IF(INDIRECT(Profile2)=D13,INDIRECT(Profile2)))=0,\"---\",(MIN(IF(INDIRECT(Profile2)=D13,INDIRECT(Profile2)))))","v":"---"},null,null,null,"Type"]
[null,null,"Pitch Lenght [mm]",{"$f":"IF(D12=\"\",\"\",D12-(VLOOKUP(D11,LIST!A14:C25,2,FALSE)))","v":""},null,"Match",{"$f":"IF(G12=\"---\",\"NO\",\"YES\")","v":"NO"},null,null,null,"Internal Lenght [mm]",{"$f":"IFERROR(VLOOKUP(L12,'Z-C'!B:D,2,FALSE),\"\")","v":""}]
[null,null,null,null,null,null,null,null,null,null,"Pitch Lenght [mm]",{"$f":"IFERROR(VLOOKUP(L12,'Z-C'!B:D,3,FALSE),\"\")","v":""}]
[]
[]
[null,null,"Alternative Belt",null,null,null,null,null,null,null,"WRAPPED - NARROW SECTION"]
[null,null,null,"Belt","Pitch Lenght [mm]","External Lenght [mm]","C/C [mm] *",null,null,null,"Section",{"$f":"IFERROR(VLOOKUP(L11,LIST!A2:C5,2,FALSE),\"\")","v":"SPZ"},"Pitch Lenght [mm]","C/C [mm] *"]
[null,null,"Longer Belt",{"$f":"IFERROR(IF(D12=\"\",\"\",VLOOKUP(E19,INDIRECT(Profile5),2,FALSE)),\"\")","v":""},{"$f":"IF(D12=\"\",\"\",IF((MIN(IF(INDIRECT(Profile2)>D13,INDIRECT(Profile2))))=0,\"\",(MIN(IF(INDIRECT(Profile2)>D13,INDIRECT(Profile2))))))","v":""},{"$f":"IFERROR(E19+(VLOOKUP(D11,Section3,2,FALSE)),\"\")","v":""},{"$f":"IFERROR(\"+  \"&((F19-D12)/2),\"\")","v":""},null,null,null,"Longer Belt",{"$f":"IF(L12=\"\",\"\",IF((MIN(IF(INDIRECT(Profile3)>L14,INDIRECT(Profile3))))=0,\"\",(MIN(IF(INDIRECT(Profile3)>L14,INDIRECT(Profile3))))))","v":""},{"$f":"IFERROR(IF(L19=0,\"\",\"+  \"&L19-L14),\"\")","v":""},{"$f":"IFERROR(IF(L19=0,\"\",\"+  \"&(L19-L14)/2),\"\")","v":""}]
[null,null,"Shorter Belt",{"$f":"IFERROR(IF(D12=\"\",\"\",VLOOKUP(E20,INDIRECT(Profile5),2,FALSE)),\"\")","v":""},{"$f":"IF(D12=\"\",\"\",IF((MAX(IF(INDIRECT(Profile2)<D13,INDIRECT(Profile2))))=0,\"\",(MAX(IF(INDIRECT(Profile2)<D13,INDIRECT(Profile2))))))","v":""},{"$f":"IFERROR(E20+(VLOOKUP(D11,Section3,2,FALSE)),\"\")","v":""},{"$f":"IFERROR(\"-  \"&(D12-F20)/2,\"\")","v":""},null,null,null,"Shorter Belt",{"$f":"IF(L12=\"\",\"\",IF(MAX(IF(INDIRECT(Profile3)<L14,INDIRECT(Profile3)))=0,\"\",MAX(IF(INDIRECT(Profile3)<L14,INDIRECT(Profile3)))))","v":""},{"$f":"IFERROR(IF(L20=0,\"\",\"-  \"&L14-L20),\"\")","v":""},{"$f":"IFERROR(IF(L20=0,\"\",\"-  \"&(L14-L20)/2),\"\")","v":""}]
[]
[]
[null,null,null,null,null,null,null,null,null,null,"RAW EDGE - NARROW SECTION"]
[null,null,null,"X:",{"$f":"IFERROR(VLOOKUP(D11,LIST!A14:F25,4,FALSE),\"\")","v":"40°"},null,null,null,null,null,"Section",{"$f":"IFERROR(VLOOKUP(L11,LIST!A2:C5,3,FALSE),\"\")","v":"XPZ"},"Pitch Lenght [mm]","C/C [mm] *"]
[null,null,null,"Y:",{"$f":"IFERROR(VLOOKUP(D11,LIST!A14:F25,5,FALSE),\"\")","v":10},null,null,null,null,null,"Longer Belt",{"$f":"IF(L12=\"\",\"\",IF(MIN(IF(INDIRECT(Profile4)>L14,INDIRECT(Profile4)))=0,\"\",MIN(IF(INDIRECT(Profile4)>L14,INDIRECT(Profile4)))))","v":""},{"$f":"IFERROR(IF(L25=0,\"\",\"+  \"&L25-L14),\"\")","v":""},{"$f":"IFERROR(IF(L25=0,\"\",\"+  \"&(L25-L14)/2),\"\")","v":""}]
[null,null,null,"Z:",{"$f":"IFERROR(VLOOKUP(D11,LIST!A14:F25,6,FALSE),\"\")","v":6},null,null,null,null,null,"Shorter Belt",{"$f":"IF(L12=\"\",\"\",IF(MAX(IF(INDIRECT(Profile4)<L14,INDIRECT(Profile4)))=0,\"\",MAX(IF(INDIRECT(Profile4)<L14,INDIRECT(Profile4)))))","v":""},{"$f":"IFERROR(IF(L26=0,\"\",\"-  \"&L14-L26),\"\")","v":""},{"$f":"IFERROR(IF(L26=0,\"\",\"-  \"&(L14-L26)/2),\"\")","v":""}]
[]
[null,null,null,null,null,null,"*Centre distance between equal sized pulleys.",null,null,null,null,null,null,"*Centre distance between equal sized pulleys."]
[null,"www.megadynegroup.com",null,null,null,null,null,null,null,"www.megadynegroup.com"]
[]
["Copyright© Megadyne Nordic. All rights reserved.",null,null,null,null,null,null,null,null,null,null,null,null,null,null,"2018-09-24 - JOHJOR"]

{"sheet":"LIST","index":1,"n_rows":25,"n_cols":6,"rows_kept":25,"cut":false,"hidden":true,"merged":[]}
["Section"]
["Z","SPZ","XPZ"]
["A","SPA","XPA"]
["B","SPB","XPB"]
["C","SPC","XPC"]
[]
[{"$f":"'V-Belt Reference Search'!L11&\"_1\"","v":"Z_1"}]
[{"$f":"'V-Belt Reference Search'!D11&\"_2\"","v":"Z_2"}]
[{"$f":"'V-Belt Reference Search'!L18&\"_2\"","v":"SPZ_2"}]
[{"$f":"'V-Belt Reference Search'!L24&\"_2\"","v":"XPZ_2"}]
[{"$f":"'V-Belt Reference Search'!D11&\"_3\"","v":"Z_3"}]
[]
["Section","Ext to Pitch ","Ext to Inter","X","Y","Z"]
["Z",13,38,"40°",10,6]
["A",17,50,"40°",13,8]
["B",26,69,"40°",17,11]
["C",26,88,"40°",22,14]
["SPZ",13,52,"38°",9.6999999999999993,8]
["SPA",18,65,"38°",12.7,10]
["SPB",22,83,"38°",16.3,13]
["SPC",30,116,"38°",22,18]
["XPZ",13,null,"38°",9.6999999999999993,8]
["XPA",18,null,"38°",12.7,10]
["XPB",22,null,"38°",16.3,13]
["XPC",30,null,"38°",22,18]

{"sheet":"Z-C","index":2,"n_rows":634,"n_cols":4,"rows_kept":634,"cut":false,"hidden":true,"merged":[]}
[]
["LD","Section - Z","LI","LD"]
[435,"Z 16",410,435]
[485,"Z 18",460,485]
[505,"Z 19",480,505]
[525,"Z 19 1/2",500,525]
[533,"Z 20",508,533]
[545,"Z 20 1/2",520,545]
[555,"Z 21",530,555]
[565,"Z 21 1/4",540,565]
[570,"Z 21 1/2",545,570]
[580,"Z 21 3/4",555,580]
[585,"Z 22",560,585]
[590,"Z 22 1/4",565,590]
[600,"Z 22 1/2",575,600]
[610,"Z 23",585,610]
[625,"Z 23 1/2",600,625]
[630,"Z 23 3/4",605,630]
[635,"Z 24",610,635]
[655,"Z 24 3/4",630,655]
[660,"Z 25",635,660]
[675,"Z 25 1/2",650,675]
[685,"Z 26",660,685]
[695,"Z 26 1/2",670,695]
[710,"Z 27",685,710]
[725,"Z 27 1/2",700,725]
[735,"Z 28",710,735]
[750,"Z 28 1/2",725,750]
[760,"Z 29",735,760]
[775,"Z 29 1/2",750,775]
[790,"Z 30",765,790]
[800,"Z 30 1/2",775,800]
[810,"Z 30 3/4",785,810]
[812,"Z 31",787,812]
[825,"Z 31 1/2",800,825]
[840,"Z 32",815,840]
[850,"Z 32 1/2",825,850]
[865,"Z 33",840,865]
[875,"Z 33 1/2",850,875]
[890,"Z 34",865,890]
[900,"Z 34 1/2",875,900]
[895,"Z 34 1/4",870,895]
[915,"Z 35",890,915]
[925,"Z 35 1/2",900,925]
[940,"Z 36",915,940]
[950,"Z 36 1/2",925,950]
[960,"Z 36 3/4",935,960]
[970,"Z 37",945,970]
[975,"Z 37 1/2",950,975]
[990,"Z 38",965,990]
[1000,"Z 38 1/4",975,1000]
[1003,"Z 38 1/2",978,1003]
[1025,"Z 39",1000,1025]
[1041,"Z 40",1016,1041]
[1055,"Z 40 1/2",1030,1055]
[1065,"Z 41",1040,1065]
[1075,"Z 41 1/2",1050,1075]
[1085,"Z 41 3/4",1060,1085]
[1095,"Z 42",1070,1095]
[1105,"Z 42 1/2",1080,1105]
[1115,"Z 43",1090,1115]
[1125,"Z 43 1/4",1100,1125]
[1145,"Z 44",1120,1145]
[1170,"Z 45",1145,1170]
[1205,"Z 46",1180,1205]
[1219,"Z 47",1194,1219]
[1240,"Z 47 3/4",1215,1240]
[1250,"Z 48",1225,1250]
[1257,"Z 48 1/2",1232,1257]
[1270,"Z 49",1245,1270]
[1295,"Z 50",1270,1295]
[1310,"Z 50 1/2",1285,1310]
[1325,"Z 51",1300,1325]
[1345,"Z 52",1320,1345]
[1370,"Z 53",1345,1370]
[1396,"Z 54",1371,1396]
[1425,"Z 55",1400,1425]
[1447,"Z 56",1422,1447]
[1475,"Z 57",1450,1475]
[1498,"Z 58",1473,1498]
[1525,"Z 59",1500,1525]
[1540,"Z 59 1/2",1515,1540]
[1550,"Z 60",1525,1550]
[1575,"Z 61",1550,1575]
[1600,"Z 62",1575,1600]
[1625,"Z 63",1600,1625]
[1650,"Z 64",1625,1650]
[1676,"Z 65",1651,1676]
[1700,"Z 66",1675,1700]
[1725,"Z 67",1700,1725]
[1752,"Z 68",1727,1752]
[1765,"Z 68 1/2",1740,1765]
[1775,"Z 69",1750,1775]
[1803,"Z 70",1778,1803]
[1828,"Z 71",1803,1828]
[1880,"Z 73",1855,1880]
[1930,"Z 75",1905,1930]
[2007,"Z 78",1982,2007]
[2032,"Z 79",2007,2032]
[2145,"Z 83 1/2",2100,2145]
[2260,"Z 88",2235,2260]
[2385,"Z 93",2360,2385]
[2514,"Z 98",2489,2514]
[]
["LD","Section - A","LI","LD"]
[490,"A 18",457,490]
[513,"A 19",480,513]
[541,"A 20",508,541]
[568,"A 21",535,568]
[585,"A 21 3/4",552,585]
[593,"A 22",560,593]
[620,"A 23",587,620]
[633,"A 23 1/2",600,633]
[643,"A 24",610,643]
[653,"A 24 1/2",620,653]
[663,"A 24 3/4",630,663]
[670,"A 25",637,670]
[680,"A 25 1/2",647,680]
[693,"A 26",660,693]
[703,"A 26 1/2",670,703]
[719,"A 27",686,719]
[733,"A 27 1/2",700,733]
[743,"A 28",710,743]
[757,"A 28 1/2",724,757]
[770,"A 29",737,770]
[783,"A 29 1/2",750,783]
[800,"A 30",767,800]
[808,"A 30 1/2",775,808]
[820,"A 31",787,820]
[833,"A 31 1/2",800,833]
[846,"A 32",813,846]
[858,"A 32 1/2",825,858]
[871,"A 33",838,871]
[880,"A 33 1/4",847,880]
[883,"A 33 1/2",850,883]
[900,"A 34",867,900]
[908,"A 34 1/2",875,908]
[933,"A 35",900,933]
[935,"A 35 1/2",902,935]
[947,"A 36",914,947]
[958,"A 36 1/2",925,958]
[975,"A 37",942,975]
[979,"A 37 1/4",946,979]
[983,"A 37 1/2",950,983]
[998,"A 38",965,998]
[1008,"A 38 1/2",975,1008]
[1025,"A 39",992,1025]
[1033,"A 39 1/2",1000,1033]
[1049,"A 40",1016,1049]
[1063,"A 40 1/2",1030,1063]
[1074,"A 41",1041,1074]
[1083,"A 41 1/2",1050,1083]
[1093,"A 41 3/4",1060,1093]
[1100,"A 42",1067,1100]
[1108,"A 42 1/2",1075,1108]
[1133,"A 43",1100,1133]
[1138,"A 43 1/2",1105,1138]
[1144,"A 43 3/4",1111,1144]
[1153,"A 44",1120,1153]
[1165,"A 44 1/2",1132,1165]
[1176,"A 45",1143,1176]
[1183,"A 45 1/2",1150,1183]
[1201,"A 46",1168,1201]
[1213,"A 46 1/2",1180,1213]
[1233,"A 47",1200,1233]
[1240,"A 47 1/2",1207,1240]
[1253,"A 48",1220,1253]
[1264,"A 48 1/2",1232,1264]
[1258,"A 48 1/4",1225,1258]
[1283,"A 49",1250,1283]
[1303,"A 50",1270,1303]
[1333,"A 51",1300,1333]
[1340,"A 51 1/2",1307,1340]
[1353,"A 52",1320,1353]
[1370,"A 52 1/2",1337,1370]
[1379,"A 53",1346,1379]
[1388,"A 53 1/4",1355,1388]
[1405,"A 54",1372,1405]
[1433,"A 55",1400,1433]
[1455,"A 56",1422,1455]
[1483,"A 57",1450,1483]
[1508,"A 58",1475,1508]
[1533,"A 59",1500,1533]
[1558,"A 60",1525,1558]
[1583,"A 61",1550,1583]
[1608,"A 62",1575,1608]
[1633,"A 63",1600,1633]
[1658,"A 64",1625,1658]
[1683,"A 65",1650,1683]
[1709,"A 66",1676,1709]
[1733,"A 67",1700,1733]
[1758,"A 68",1725,1758]
[1783,"A 69",1750,1783]
[1808,"A 70",1775,1808]
[1813,"A 70 3/4",1780,1813]
[1833,"A 71",1800,1833]
[1858,"A 72",1825,1858]
[1887,"A 73",1854,1887]
[1913,"A 74",1880,1913]
[1933,"A 75",1900,1933]
{"$rows_left_out":435}
{"sheet":"SPZ-SPC","index":3,"n_rows":374,"n_cols":4,"rows_kept":374,"cut":false,"hidden":true,"merged":[]}
[]
["LW","Section - SPZ ","LA","LW"]
[487,"SPZ 487",500,487]
[512,"SPZ 512",525,512]
[562,"SPZ 562",575,562]
[587,"SPZ 587",600,587]
[607,"SPZ 607",620,607]
[612,"SPZ 612",625,612]
[630,"SPZ 630",643,630]
[637,"SPZ 637",650,637]
[662,"SPZ 662",675,662]
[670,"SPZ 670",683,670]
[687,"SPZ 687",700,687]
[710,"SPZ 710",723,710]
[722,"SPZ 722",735,722]
[737,"SPZ 737",750,737]
[750,"SPZ 750",763,750]
[762,"SPZ 762",775,762]
[772,"SPZ 772",785,772]
[787,"SPZ 787",800,787]
[800,"SPZ 800",813,800]
[812,"SPZ 812",825,812]
[825,"SPZ 825",838,825]
[837,"SPZ 837",850,837]
[850,"SPZ 850",863,850]
[862,"SPZ 862",875,862]
[875,"SPZ 875",888,875]
[887,"SPZ 887",900,887]
[900,"SPZ 900",913,900]
[912,"SPZ 912",925,912]
[922,"SPZ 922",935,922]
[925,"SPZ 925",938,925]
[937,"SPZ 937",950,937]
[950,"SPZ 950",963,950]
[962,"SPZ 962",975,962]
[975,"SPZ 975",988,975]
[987,"SPZ 987",1000,987]
[1000,"SPZ 1000",1013,1000]
[1010,"SPZ 1010",1023,1010]
[1012,"SPZ 1012",1025,1012]
[1024,"SPZ 1024",1037,1024]
[1037,"SPZ 1037",1050,1037]
[1047,"SPZ 1047",1060,1047]
[1060,"SPZ 1060",1073,1060]
[1077,"SPZ 1077",1090,1077]
[1087,"SPZ 1087",1100,1087]
[1112,"SPZ 1112",1125,1112]
[1120,"SPZ 1120",1133,1120]
[1137,"SPZ 1137",1150,1137]
[1140,"SPZ 1140",1153,1140]
[1147,"SPZ 1147",1160,1147]
[1150,"SPZ 1150",1163,1150]
[1162,"SPZ 1162",1175,1162]
[1180,"SPZ 1180",1193,1180]
[1187,"SPZ 1187",1200,1187]
[1200,"SPZ 1200",1213,1200]
[1202,"SPZ 1202",1215,1202]
[1212,"SPZ 1212",1225,1212]
[1237,"SPZ 1237",1250,1237]
[1250,"SPZ 1250",1263,1250]
[1262,"SPZ 1262",1275,1262]
[1270,"SPZ 1270",1283,1270]
[1287,"SPZ 1287",1300,1287]
[1312,"SPZ 1312",1325,1312]
[1320,"SPZ 1320",1333,1320]
[1337,"SPZ 1337",1350,1337]
[1340,"SPZ 1340",1353,1340]
[1347,"SPZ 1347",1360,1347]
[1362,"SPZ 1362",1375,1362]
[1387,"SPZ 1387",1400,1387]
[1400,"SPZ 1400",1413,1400]
[1412,"SPZ 1412",1425,1412]
[1420,"SPZ 1420",1433,1420]
[1437,"SPZ 1437",1450,1437]
[1462,"SPZ 1462",1475,1462]
[1470,"SPZ 1470",1483,1470]
[1487,"SPZ 1487",1500,1487]
[1500,"SPZ 1500",1513,1500]
[1512,"SPZ 1512",1525,1512]
[1520,"SPZ 1520",1533,1520]
[1537,"SPZ 1537",1550,1537]
[1562,"SPZ 1562",1575,1562]
[1587,"SPZ 1587",1600,1587]
[1600,"SPZ 1600",1613,1600]
[1612,"SPZ 1612",1625,1612]
[1637,"SPZ 1637",1650,1637]
[1650,"SPZ 1650",1663,1650]
[1662,"SPZ 1662",1675,1662]
[1687,"SPZ 1687",1700,1687]
[1700,"SPZ 1700",1713,1700]
[1737,"SPZ 1737",1750,1737]
[1750,"SPZ 1750",1763,1750]
[1762,"SPZ 1762",1775,1762]
[1787,"SPZ 1787",1800,1787]
[1800,"SPZ 1800",1813,1800]
[1812,"SPZ 1812",1825,1812]
[1837,"SPZ 1837",1850,1837]
[1850,"SPZ 1850",1863,1850]
[1862,"SPZ 1862",1875,1862]
[1887,"SPZ 1887",1900,1887]
[1900,"SPZ 1900",1913,1900]
[1937,"SPZ 1937",1950,1937]
[1962,"SPZ 1962",1975,1962]
[1987,"SPZ 1987",2000,1987]
[2000,"SPZ 2000",2013,2000]
[2019,"SPZ 2019",2032,2019]
[2030,"SPZ 2030",2043,2030]
[2037,"SPZ 2037",2050,2037]
[2062,"SPZ 2062",2075,2062]
[2087,"SPZ 2087",2100,2087]
[2120,"SPZ 2120",2133,2120]
[2137,"SPZ 2137",2150,2137]
[2150,"SPZ 2150",2163,2150]
[2160,"SPZ 2160",2173,2160]
[2187,"SPZ 2187",2200,2187]
[2240,"SPZ 2240",2253,2240]
[2262,"SPZ 2262",2275,2262]
[2287,"SPZ 2287",2300,2287]
[2360,"SPZ 2360",2373,2360]
[2410,"SPZ 2410",2423,2410]
[2437,"SPZ 2437",2450,2437]
[2487,"SPZ 2487",2500,2487]
[2500,"SPZ 2500",2513,2500]
[2540,"SPZ 2540",2553,2540]
[2650,"SPZ 2650",2663,2650]
[2690,"SPZ 2690",2703,2690]
[2800,"SPZ 2800",2813,2800]
[2840,"SPZ 2840",2853,2840]
[3000,"SPZ 3000",3013,3000]
[3150,"SPZ 3150",3163,3150]
[3350,"SPZ 3350",3363,3350]
[3550,"SPZ 3550",3563,3550]
[]
["LW","Section - SPA","LA","LW"]
[657,"SPA 657",675,657]
[707,"SPA 707",725,707]
[732,"SPA 732",750,732]
[757,"SPA 757",775,757]
[782,"SPA 782",800,782]
[800,"SPA 800",818,800]
[807,"SPA 807",825,807]
[832,"SPA 832",850,832]
[850,"SPA 850",868,850]
[857,"SPA 857",875,857]
[882,"SPA 882",900,882]
[900,"SPA 900",918,900]
[907,"SPA 907",925,907]
[925,"SPA 925",943,925]
[932,"SPA 932",950,932]
[950,"SPA 950",968,950]
[957,"SPA 957",975,957]
[967,"SPA 967",985,967]
[982,"SPA 982",1000,982]
[1000,"SPA 1000",1018,1000]
[1007,"SPA 1007",1025,1007]
[1032,"SPA 1032",1050,1032]
[1060,"SPA 1060",1078,1060]
[1082,"SPA 1082",1100,1082]
[1107,"SPA 1107",1125,1107]
[1120,"SPA 1120",1138,1120]
[1132,"SPA 1132",1150,1132]
[1150,"SPA 1150",1168,1150]
[1157,"SPA 1157",1175,1157]
[1180,"SPA 1180",1198,1180]
[1207,"SPA 1207",1225,1207]
[1232,"SPA 1232",1250,1232]
[1250,"SPA 1250",1268,1250]
[1257,"SPA 1257",1275,1257]
[1272,"SPA 1272",1290,1272]
[1282,"SPA 1282",1300,1282]
[1307,"SPA 1307",1325,1307]
[1320,"SPA 1320",1338,1320]
[1332,"SPA 1332",1350,1332]
[1357,"SPA 1357",1375,1357]
[1382,"SPA 1382",1400,1382]
[1400,"SPA 1400",1418,1400]
[1407,"SPA 1407",1425,1407]
[1425,"SPA 1425",1443,1425]
[1432,"SPA 1432",1450,1432]
[1450,"SPA 1450",1468,1450]
[1457,"SPA 1457",1475,1457]
[1482,"SPA 1482",1500,1482]
[1500,"SPA 1500",1518,1500]
[1507,"SPA 1507",1525,1507]
[1532,"SPA 1532",1550,1532]
[1550,"SPA 1550",1568,1550]
[1557,"SPA 1557",1575,1557]
[1582,"SPA 1582",1600,1582]
[1600,"SPA 1600",1618,1600]
[1607,"SPA 1607",1625,1607]
[1632,"SPA 1632",1650,1632]
[1657,"SPA 1657",1675,1657]
[1682,"SPA 1682",1700,1682]
[1700,"SPA 1700",1718,1700]
[1707,"SPA 1707",1725,1707]
[1732,"SPA 1732",1750,1732]
[1750,"SPA 1750",1768,1750]
[1757,"SPA 1757",1775,1757]
[1782,"SPA 1782",1800,1782]
[1800,"SPA 1800",1818,1800]
{"$rows_left_out":175}
{"sheet":"XPZ-XPC","index":4,"n_rows":300,"n_cols":3,"rows_kept":300,"cut":false,"hidden":true,"merged":[]}
["LW","XPZ","LW"]
[512,"XPZ 512",512]
[562,"XPZ 562",562]
[587,"XPZ 587",587]
[607,"XPZ 607",607]
[612,"XPZ 612",612]
[630,"XPZ 630",630]
[637,"XPZ 637",637]
[662,"XPZ 662",662]
[670,"XPZ 670",670]
[687,"XPZ 687",687]
[710,"XPZ 710",710]
[722,"XPZ 722",722]
[730,"XPZ 730",730]
[737,"XPZ 737",737]
[750,"XPZ 750",750]
[762,"XPZ 762",762]
[772,"XPZ 772",772]
[787,"XPZ 787",787]
[800,"XPZ 800",800]
[812,"XPZ 812",812]
[837,"XPZ 837",837]
[850,"XPZ 850",850]
[852,"XPZ 852",852]
[862,"XPZ 862",862]
[875,"XPZ 875",875]
[887,"XPZ 887",887]
[900,"XPZ 900",900]
[912,"XPZ 912",912]
[925,"XPZ 925",925]
[937,"XPZ 937",937]
[940,"XPZ 940",940]
[950,"XPZ 950",950]
[962,"XPZ 962",962]
[975,"XPZ 975",975]
[987,"XPZ 987",987]
[1000,"XPZ 1000",1000]
[1012,"XPZ 1012",1012]
[1024,"XPZ 1024",1024]
[1030,"XPZ 1030",1030]
[1037,"XPZ 1037",1037]
[1047,"XPZ 1047",1047]
[1060,"XPZ 1060",1060]
[1062,"XPZ 1062",1062]
[1077,"XPZ 1077",1077]
[1080,"XPZ 1080",1080]
[1087,"XPZ 1087",1087]
[1112,"XPZ 1112",1112]
[1120,"XPZ 1120",1120]
[1137,"XPZ 1137",1137]
[1162,"XPZ 1162",1162]
[1180,"XPZ 1180",1180]
[1187,"XPZ 1187",1187]
[1202,"XPZ 1202",1202]
[1212,"XPZ 1212",1212]
[1237,"XPZ 1237",1237]
[1250,"XPZ 1250",1250]
[1262,"XPZ 1262",1262]
[1270,"XPZ 1270",1270]
[1280,"XPZ 1280",1280]
[1287,"XPZ 1287",1287]
[1312,"XPZ 1312",1312]
[1320,"XPZ 1320",1320]
[1337,"XPZ 1337",1337]
[1362,"XPZ 1362",1362]
[1387,"XPZ 1387",1387]
[1400,"XPZ 1400",1400]
[1412,"XPZ 1412",1412]
[1420,"XPZ 1420",1420]
[1437,"XPZ 1437",1437]
[1462,"XPZ 1462",1462]
[1470,"XPZ 1470",1470]
[1487,"XPZ 1487",1487]
[1500,"XPZ 1500",1500]
[1512,"XPZ 1512",1512]
[1520,"XPZ 1520",1520]
[1537,"XPZ 1537",1537]
[1562,"XPZ 1562",1562]
[1587,"XPZ 1587",1587]
[1600,"XPZ 1600",1600]
[1612,"XPZ 1612",1612]
[1637,"XPZ 1637",1637]
[1650,"XPZ 1650",1650]
[1662,"XPZ 1662",1662]
[1700,"XPZ 1700",1700]
[1737,"XPZ 1737",1737]
[1750,"XPZ 1750",1750]
[1762,"XPZ 1762",1762]
[1800,"XPZ 1800",1800]
[1812,"XPZ 1812",1812]
[1850,"XPZ 1850",1850]
[1862,"XPZ 1862",1862]
[1887,"XPZ 1887",1887]
[1900,"XPZ 1900",1900]
[1937,"XPZ 1937",1937]
[1950,"XPZ 1950",1950]
[2000,"XPZ 2000",2000]
[2030,"XPZ 2030",2030]
[2037,"XPZ 2037",2037]
[2120,"XPZ 2120",2120]
[2160,"XPZ 2160",2160]
[2240,"XPZ 2240",2240]
[2280,"XPZ 2280",2280]
[2360,"XPZ 2360",2360]
[2410,"XPZ 2410",2410]
[2500,"XPZ 2500",2500]
[2540,"XPZ 2540",2540]
[2650,"XPZ 2650",2650]
[2690,"XPZ 2690",2690]
[2800,"XPZ 2800",2800]
[2840,"XPZ 2840",2840]
[3000,"XPZ 3000",3000]
[3150,"XPZ 3150",3150]
[3170,"XPZ 3170",3170]
[3350,"XPZ 3350",3350]
[3550,"XPZ 3550",3550]
[]
["Lw","XPA","Lw"]
[667,"XPA 667",667]
[682,"XPA 682",682]
[732,"XPA 732",732]
[757,"XPA 757",757]
[782,"XPA 782",782]
[800,"XPA 800",800]
[807,"XPA 807",807]
[832,"XPA 832",832]
[850,"XPA 850",850]
[857,"XPA 857",857]
[882,"XPA 882",882]
[900,"XPA 900",900]
[907,"XPA 907",907]
[925,"XPA 925",925]
[932,"XPA 932",932]
[950,"XPA 950",950]
[957,"XPA 957",957]
[969,"XPA 969",969]
[982,"XPA 982 ",982]
[1000,"XPA 1000",1000]
[1007,"XPA 1007",1007]
[1032,"XPA 1032",1032]
[1057,"XPA 1057",1057]
[1060,"XPA 1060",1060]
[1082,"XPA 1082",1082]
[1107,"XPA 1107",1107]
[1120,"XPA 1120",1120]
[1132,"XPA 1132",1132]
[1150,"XPA 1150",1150]
[1157,"XPA 1157",1157]
[1162,"XPA 1162",1162]
[1180,"XPA 1180",1180]
[1182,"XPA 1182",1182]
[1207,"XPA 1207",1207]
[1232,"XPA 1232",1232]
[1250,"XPA 1250",1250]
[1257,"XPA 1257",1257]
[1272,"XPA 1272",1272]
[1282,"XPA 1282",1282]
[1307,"XPA 1307",1307]
[1320,"XPA 1320",1320]
[1332,"XPA 1332",1332]
[1357,"XPA 1357",1357]
[1382,"XPA 1382",1382]
[1400,"XPA 1400",1400]
[1407,"XPA 1407",1407]
[1420,"XPA 1420",1420]
[1432,"XPA 1432",1432]
[1450,"XPA 1450",1450]
[1457,"XPA 1457",1457]
[1482,"XPA 1482",1482]
[1500,"XPA 1500",1500]
[1507,"XPA 1507",1507]
[1532,"XPA 1532",1532]
[1557,"XPA 1557",1557]
[1582,"XPA 1582",1582]
[1600,"XPA 1600",1600]
[1607,"XPA 1607",1607]
[1632,"XPA 1632",1632]
[1650,"XPA 1650",1650]
[1682,"XPA 1682",1682]
[1700,"XPA 1700",1700]
[1732,"XPA 1732",1732]
[1757,"XPA 1757",1757]
[1782,"XPA 1782",1782]
[1800,"XPA 1800",1800]
[1832,"XPA 1832",1832]
[1850,"XPA 1850",1850]
[1900,"XPA 1900",1900]
[1932,"XPA 1932",1932]
[1950,"XPA 1950",1950]
[1957,"XPA 1957",1957]
[1982,"XPA 1982",1982]
[2000,"XPA 2000",2000]
[2032,"XPA 2032",2032]
[2057,"XPA 2057",2057]
[2082,"XPA 2082",2082]
[2120,"XPA 2120",2120]
[2160,"XPA 2160",2160]
[2182,"XPA 2182",2182]
[2240,"XPA 2240",2240]
[2282,"XPA 2282",2282]
{"$rows_left_out":100}